{"text_format":"2","workbook":"xlsx","n_sheets":12,"sheets":["RA Tháng 6","RA tháng 7","RA tháng 11","RA tháng 12_SOL","RA tháng 12_AI4SE","RA tháng 12_LAB SC","RA tháng 2_SOL","RA tháng 2_LAB SC","RA tháng 2_AI4SE","RA tháng 1_SOL","RA tháng 1_LAB SC","RA tháng 1_AI4SE"],"not_rendered":{"charts":0,"images":0,"macros":0,"external_links":0,"defined_names":9,"comments":0,"pivot_tables":0},"unopened":[],"bounds":{"document_bytes":16777216,"sheet_cells":100000,"run_cost":"one","rows_first":2000,"rows_last":500,"rows_between":2000,"halvings":0,"cell_chars":16384,"cell_head_chars":4096},"cells_cut":0,"cells_raw":0,"read":"whole","date_system":"1900"}

{"sheet":"RA Tháng 6","index":0,"n_rows":126,"n_cols":9,"rows_kept":126,"cut":false,"hidden":true,"merged":[]}
["No.","Account","Full Name","Site","Job Rank","Workload","On-going Project 1","PM/Tech Lead AI1","PM dự án"]
[1,"AnDN2","Đinh Ngọc Ân","HCM","DEVE01",1,"AIC.SOL.E2E AI","TienVT4"]
[2,"AnhBT57","Bùi Tuấn Anh","HCM","AIEN01",1,"AI1.SOL.CDTO.Ivy Product","DuongHT13"]
[3,"AnhMV4","Mai Việt Anh","HL","SPMA03",1,"MCP Sales Coach Training","TamNT17"]
[4,"AnhNCN1","Nguyễn Công Nam Anh","HCM","AIEN01",1,"CISD GenerativeAI","DuongHT13","SamCM1"]
[5,"AnhNDT16","Nguyễn Đoàn Tấn Anh","HN","AIEN02",1,"AI1.SOL.SBFJP","TrangNTM13"]
[6,"AnhNHQ1","Nguyễn Hoàng Quốc Anh","HN","AIEN01",0,"Support Davies => Idle","LangPNN2"]
[7,"AnhNT446","Nguyễn Tuấn Anh","HN","DASC05",0.13,"AI DRBFM","TrungND25","TinhNT27"]
[8,"AnhPT95","Phạm Tuấn Anh","HN","AIEN01",0,"Preparing Renesas Project","KhoaNT30"]
[9,"BachLN2","Lê Nho Bách","HCM","AIEN01",1,"Toppan Jokomi","DuongHT13","ThuyTTT7"]
{"$rows_left_out":117}
{"sheet":"RA tháng 7","index":1,"n_rows":124,"n_cols":13,"rows_kept":124,"cut":false,"hidden":true,"merged":[]}
["Full Name","Account","Contract Type","Location","Parent Dept","Child Dept1","Child Dept2","Customer Code","On-going Project","Status_Jul","PM","PM khác","MSC Note"]
["Vũ Nam Hưng","HungVN6","OFF","HN","AI1","AI1 SOL","AI1 SOL TE","SonyGS","GenAI PF","Allocated",{"$f":"VLOOKUP(B2,'RA Tháng 6'!$B$2:$H$126,7,FALSE)","v":"AnhMV4"}]
["Nguyễn Việt Phương","PhuongNV44","OFF","HCM","AI1","AI1 SOL","AI1 SOL TE","DMO-CDTO","AIC.SOL.E2E AI","Allocated","AnhMV4"]
["Dương Văn Thắng","ThangDV47","OFF","HCM","AI1","AI1 SOL","AI1 SOL TE","TP-M","Toppan Jokomi, MCP, HP Japan","Allocated",{"$f":"VLOOKUP(B4,'RA Tháng 6'!$B$2:$H$126,7,FALSE)","v":"AnhMV4"}]
["Tô Văn Hải","HaiTV23","OFF","HN","AI1","AI1 SOL","AI1 SOL TE","DMO-CDTO","AI1.SOL.CDTO.Ivy Product","Idle",{"$f":"VLOOKUP(B5,'RA Tháng 6'!$B$2:$H$126,7,FALSE)","v":"DuongHT13"}]
["Vũ Hải Hà","HaVH12","OFF","HN","AI1","AI1 SOL","AI1 SOL TE","DMO-CDTO","AI1.SOL.CDTO.Ivy Product","Allocated",{"$f":"VLOOKUP(B6,'RA Tháng 6'!$B$2:$H$126,7,FALSE)","v":"DuongHT13"}]
["Mai Thị Kim Ngân","NganMTK2","OFF","HCM","AI1","AI1 SOL","AI1 SOL TE","DMO-CDTO","AIC.SOL.E2E AI","Allocated",{"$f":"VLOOKUP(B7,'RA Tháng 6'!$B$2:$H$126,7,FALSE)","v":"DuongHT13"}]
["Trần Ngọc Hùng Phong","PhongTNH","OFF","HN","AI1","AI1 SOL","AI1 SOL TE","HPI","HP PJ2 IvyChat","Allocated",{"$f":"VLOOKUP(B8,'RA Tháng 6'!$B$2:$H$126,7,FALSE)","v":"DuongHT13"}]
["Đỗ Minh Quyết","QuyetDM","OFF","HN","AI1","AI1 SOL","AI1 SOL TE","SIA","AVI_MultiPO_2025","Allocated","TrungND25"]
["Chu Tuấn Thông","ThongCT2","OFF","HN","AI1","AI1 SOL","AI1 SOL TE","HPI","HP PJ2 IvyChat","Allocated",{"$f":"VLOOKUP(B10,'RA Tháng 6'!$B$2:$H$126,7,FALSE)","v":"DuongHT13"}]
{"$rows_left_out":115}
{"sheet":"RA tháng 11","index":2,"n_rows":136,"n_cols":13,"rows_kept":136,"cut":false,"hidden":true,"merged":[]}
["Full Name","Account","Location","Parent Department","Child Dept 1","Child Dept 2","Customer Code","Project Code","Status_Nov","Why Idle","PM","Adjust to PM?","MaiTTQ note"]
["Trần Ngọc Chương","ChuongTN2","HCM","AI1","AI1 SOL","AI1 SOL TE"," "," ","Idle","Làm demo projects cho các dự án SCGC","DuongHT13"," "," "]
["Lê Trung Hải","HaiLT61","HCM","AI1","AI1 SOL","AI1 SOL TE"," "," ","Idle","Làm team IvyChat","DuongHT13"," "," "]
["Bùi Henry","HenryB1","HCM","AI1","AI1 SOL","AI1 SOL TE"," "," ","Idle","Làm xMainframe","AnhNT446"," "," "]
["Đoàn Huy Hiên","HienDH4","HN","AI1","AI1 SOL","AI1 SOL TE","DMO-G0IP","AI1.SOL.PET_POC","Allocated"," ","SamCM1"," "," "]
["Nguyễn Đông Mạnh","ManhND105","HN","AI1","AI1 SOL","AI1 SOL TE"," "," ","Idle","Onboard dự án Panel Plus","LongNT173"," ","K tìm thấy"]
["Mai Ngọc Tú","TuMN2","HCM","AI1","AI1 SOL","AI1 SOL TE"," "," ","Idle","Onboard dự án NUSKIN","LongNT173"," ","k tìm thấy"]
["Nguyễn Đăng Anh Vũ","VuNDA6","HN","AI1","AI1 SOL","AI1 SOL TE"," "," ","Idle","Onboard dự án Softbank CCTV","AnhMV4"," ","k tìm thấy "]
["Phạm Hữu Việt","VietPH6","HN","AI1","AI1 SOL","AI1 SOL TE","EDWARDS","AI1.SOL.EDWARDS_Translation","Allocated"," ","langpnn2"," "," "]
["Nguyễn Đoàn Tấn Anh","AnhNDT16","HN","AI1","AI1 SOL","AI1 SOL TE","SB","AI1.SOL.SBFJP","Allocated"," ","trangntm13"," "," "]
{"$rows_left_out":127}
{"sheet":"RA tháng 12_SOL","index":3,"n_rows":148,"n_cols":9,"rows_kept":148,"cut":false,"hidden":true,"merged":[]}
["#","Account","Full Name","Head","Department","On-going Project","On-going Project 1","PM_DB.PM","MSC rating"]
[1,"AnCT5","Cấn Tường An","LanNTQ2","AI1 SOL TE",2,"CISD GenerativeAI","duonght13","lanntq2"]
[2,"AnDN2","Đinh Ngọc Ân","HaiTV23","AI1 SOL TE",0,"","DuongHT13","DuongHT13"]
[4,"AnhMV4","Mai Việt Anh","TamNT17","AI1 SOL TE",3,"Toppan Jokomi","duonght13","duonght13"]
[4,"AnhMV4","Mai Việt Anh","TamNT17","AI1 SOL TE",3,"Toppan Jokomi","anhmv4","TamNT17"]
[5,"AnhNDT16","Nguyễn Đoàn Tấn Anh",0,"AI1 SOL TE",1,"AI1.SOL.SB_Security","tungndt4","TrangNTM13"]
[8,"AnhNT446","Nguyễn Tuấn Anh","TungNT181","AI1 SOL TE",1,"AI1.SOL.DMO.xMainframe","HungNV31","TungNT181"]
[10,"AnhPT95","Phạm Tuấn Anh","KhoaNT30","AI1 SOL TE",1,"AI1.SOL.EDWARDS_Translation","langpnn2","langpnn2"]
[13,"BachLN2","Lê Nho Bách","TuanNT54","AI1 SOL TE",1,"Covestro_CIM_PDM","tuannt54","tuannt54"]
[14,"BaoHNQ1","Huỳnh Nhật Quốc Bảo",0,"AI1 SOL TE",1,"AI1.SOL.PET_POC","trungdvq","trungdvq"]
{"$rows_left_out":139}
{"sheet":"RA tháng 12_AI4SE","index":4,"n_rows":31,"n_cols":7,"rows_kept":31,"cut":false,"hidden":true,"merged":[]}
["#","Account","Full Name","Site","Head","Job title","Department"]
[9,"AnhPD23","Phạm Duy Anh","HN","ThienN","AI Engineer","AI1 AI4SE"]
[20,"CongNM8","Nguyễn Minh Công","HL","NguyetNTA8","Developer","AI1 AI4SE"]
[25,"CuongNN12","Nguyễn Như Cương","HN","MinhVTN","Developer","AI1 AI4SE"]
[27,"DangVQM","Vũ Quốc Minh Đăng","HCM","ThienN","AI Engineer","AI1 AI4SE"]
[43,"DuongLLD","Lâm Lữ Đức Dương","HCM","TrinhVC3","Data Engineer","AI1 AI4SE"]
[44,"DuongNH59","Nguyễn Hải Dương","HN","MinhVTN","AI Engineer","AI1 AI4SE"]
[66,"HieuPT65","Phùng Thanh Hiếu","HN","MinhVTN","Developer","AI1 AI4SE"]
[68,"HieuTT50","Trần Trung Hiếu","HCM","TungNT181","Engineering Manager","AI1 AI4SE"]
[75,"HungPV65","Phạm Vũ Hùng","HN","TrinhVC3","AI Engineer","AI1 AI4SE"]
{"$rows_left_out":22}
{"sheet":"RA tháng 12_LAB SC","index":5,"n_rows":22,"n_cols":7,"rows_kept":22,"cut":false,"hidden":true,"merged":[]}
["#","Account","Full Name","Site","Head","Job title","MSC"]
[3,"AnhBT57","Bùi Tuấn Anh","HCM","HaiTV23","AI Engineer","DuongHT13"]
[17,"C-TienNN","Nguyen Nhut Tien","USA","VanNTH19","Developer","VanNTH19"]
[30,"DatDT67","Đỗ Thành Đạt","HN","HaiTV23","Developer","DuongHT13"]
[54,"HanVT2","Vũ Thị Hân","HN","NgocLTB1","UI/UX Designer","NgocLTB1"]
[56,"HaVH12","Vũ Hải Hà","HN","HaiTV23","Developer","DuongHT13"]
[59,"HienDT65","Đỗ Thu Hiền","HN","MaiTTQ","Executive Assistant","MaiTTQ"]
[67,"HieuTH7","Thân Huy Hiệu","HCM","HaiTV23","Developer","DuongHT13"]
[94,"KhuongND6","Nguyễn Duy Khương","HCM","PhongNX1","Data Scientist","PhongNX1"]
[105,"LuongPTT","Phạm Trần Trung Lượng","HCM","HaiTV23","AI Engineer","DuongHT13"]
{"$rows_left_out":13}
{"sheet":"RA tháng 2_SOL","index":6,"n_rows":129,"n_cols":11,"rows_kept":129,"cut":false,"hidden":false,"merged":[]}
["#","Account","Full Name","Department","On-going Project","On-going Project 1","PM_DB.PM","PM_DB. AI1 PM","MSC tháng 2 ","MSC tháng 1","Matching Status"]
[1,"AnCT5","Cấn Tường An","AI1 SOL TE",2,"CISD GenerativeAI","duonght13","duonght13",{"$f":"IFERROR(VLOOKUP(Table10[[#This Row],[Account]],Table6[[#All],[Account]:[MSC PIC]],9,FALSE), \"New Hire\")","v":"LanNTQ2"},{"$f":"IFERROR(VLOOKUP(Table10[[#This Row],[Account]],Table6[[#All],[Account]:[MSC PIC]],9,FALSE), \"New Hire\")","v":"LanNTQ2"},{"$f":"IF(Table10[[#This Row],[MSC tháng 1]]=\"New Hire\", \"New Hire\", IF(Table10[[#This Row],[MSC tháng 2 ]]=Table10[[#This Row],[MSC tháng 1]],\"Match\",\"New Project or New PM\"))","v":"Match"}]
[2,"AnDN2","Đinh Ngọc Ân","AI1 SOL TE",0,"",null,null,"HaiTV23",{"$f":"IFERROR(VLOOKUP(Table10[[#This Row],[Account]],Table6[[#All],[Account]:[MSC PIC]],9,FALSE), \"New Hire\")","v":"HaiTV23"},{"$f":"IF(Table10[[#This Row],[MSC tháng 1]]=\"New Hire\", \"New Hire\", IF(Table10[[#This Row],[MSC tháng 2 ]]=Table10[[#This Row],[MSC tháng 1]],\"Match\",\"New Project or New PM\"))","v":"Match"}]
[3,"AnhNT446","Nguyễn Tuấn Anh","AI1 SOL TE",2,"",null,null,"trangntm13",{"$f":"IFERROR(VLOOKUP(Table10[[#This Row],[Account]],Table6[[#All],[Account]:[MSC PIC]],9,FALSE), \"New Hire\")","v":"trangntm13"},{"$f":"IF(Table10[[#This Row],[MSC tháng 1]]=\"New Hire\", \"New Hire\", IF(Table10[[#This Row],[MSC tháng 2 ]]=Table10[[#This Row],[MSC tháng 1]],\"Match\",\"New Project or New PM\"))","v":"Match"}]
[4,"AnhNV190","Nguyễn Việt Anh","AI1 SOL TE",1,"AIFarm","trungdvq","trungdvq","trungdvq",{"$f":"IFERROR(VLOOKUP(Table10[[#This Row],[Account]],Table6[[#All],[Account]:[MSC PIC]],9,FALSE), \"New Hire\")","v":"trungdvq"},{"$f":"IF(Table10[[#This Row],[MSC tháng 1]]=\"New Hire\", \"New Hire\", IF(Table10[[#This Row],[MSC tháng 2 ]]=Table10[[#This Row],[MSC tháng 1]],\"Match\",\"New Project or New PM\"))","v":"Match"}]
[5,"AnhPT95","Phạm Tuấn Anh","AI1 SOL TE",1,"AI DRBFM","tinhnt27","trungnd25","trungnd25",{"$f":"IFERROR(VLOOKUP(Table10[[#This Row],[Account]],Table6[[#All],[Account]:[MSC PIC]],9,FALSE), \"New Hire\")","v":"trungnd25"},{"$f":"IF(Table10[[#This Row],[MSC tháng 1]]=\"New Hire\", \"New Hire\", IF(Table10[[#This Row],[MSC tháng 2 ]]=Table10[[#This Row],[MSC tháng 1]],\"Match\",\"New Project or New PM\"))","v":"Match"}]
[6,"AnhTQ7116","Trần Quang Anh","AI1 SOL TE",0,"",null,null,"KhuongND6",{"$f":"IFERROR(VLOOKUP(Table10[[#This Row],[Account]],Table6[[#All],[Account]:[MSC PIC]],9,FALSE), \"New Hire\")","v":"KhuongND6"},{"$f":"IF(Table10[[#This Row],[MSC tháng 1]]=\"New Hire\", \"New Hire\", IF(Table10[[#This Row],[MSC tháng 2 ]]=Table10[[#This Row],[MSC tháng 1]],\"Match\",\"New Project or New PM\"))","v":"Match"}]
[7,"BaoHNQ1","Huỳnh Nhật Quốc Bảo","AI1 SOL TE",1,"AI1.SOL.PET_POC","trungdvq","trungdvq","trungdvq",{"$f":"IFERROR(VLOOKUP(Table10[[#This Row],[Account]],Table6[[#All],[Account]:[MSC PIC]],9,FALSE), \"New Hire\")","v":"trungdvq"},{"$f":"IF(Table10[[#This Row],[MSC tháng 1]]=\"New Hire\", \"New Hire\", IF(Table10[[#This Row],[MSC tháng 2 ]]=Table10[[#This Row],[MSC tháng 1]],\"Match\",\"New Project or New PM\"))","v":"Match"}]
[8,"BinhPC","Phan Công Bình","AI1 SOL TE",1,"TESTVISTA2026",null,null,"TungNT181",{"$f":"IFERROR(VLOOKUP(Table10[[#This Row],[Account]],Table6[[#All],[Account]:[MSC PIC]],9,FALSE), \"New Hire\")","v":"trungnd25"},{"$f":"IF(Table10[[#This Row],[MSC tháng 1]]=\"New Hire\", \"New Hire\", IF(Table10[[#This Row],[MSC tháng 2 ]]=Table10[[#This Row],[MSC tháng 1]],\"Match\",\"New Project or New PM\"))","v":"New Project or New PM"}]
[9,"ChuongTN2","Trần Ngọc Chương","AI1 SOL TE",1,"AI1.SOL.PNP","longnt173","longnt173","longnt173",{"$f":"IFERROR(VLOOKUP(Table10[[#This Row],[Account]],Table6[[#All],[Account]:[MSC PIC]],9,FALSE), \"New Hire\")","v":"longnt173"},{"$f":"IF(Table10[[#This Row],[MSC tháng 1]]=\"New Hire\", \"New Hire\", IF(Table10[[#This Row],[MSC tháng 2 ]]=Table10[[#This Row],[MSC tháng 1]],\"Match\",\"New Project or New PM\"))","v":"Match"}]
{"$rows_left_out":120}
{"sheet":"RA tháng 2_LAB SC","index":7,"n_rows":24,"n_cols":10,"rows_kept":24,"cut":false,"hidden":false,"merged":[]}
["#","Account","Full Name","Site","Head","Job title","Job Rank","MSC","MSC tháng 1","Matching Status"]
[1,"AnhBT57","Bùi Tuấn Anh","HCM","HaiTV23","AI Engineer","AIEN02","DuongHT13",{"$f":"IFERROR(VLOOKUP(Table12[[#This Row],[Account]],Detail_NV__28[[#All],[Account]:[MSC PIC]],6,FALSE), \"New Hire\")","v":"DuongHT13"},{"$f":"IF(Table12[[#This Row],[MSC tháng 1]]=\"New Hire\", \"New Hire\", IF(Table12[[#This Row],[MSC tháng 1]]=Table12[[#This Row],[MSC]],\"Match\",\"New Project or New PM\"))","v":"Match"}]
[2,"C-TienNN","Nguyen Nhut Tien","USA","VanNTH19","Developer","DEVE01","KhuongND6",{"$f":"IFERROR(VLOOKUP(Table12[[#This Row],[Account]],Detail_NV__28[[#All],[Account]:[MSC PIC]],6,FALSE), \"New Hire\")","v":"VanNTH19"},{"$f":"IF(Table12[[#This Row],[MSC tháng 1]]=\"New Hire\", \"New Hire\", IF(Table12[[#This Row],[MSC tháng 1]]=Table12[[#This Row],[MSC]],\"Match\",\"New Project or New PM\"))","v":"New Project or New PM"}]
[3,"DatDT67","Đỗ Thành Đạt","HN","HaiTV23","Developer","DEVE04","DuongHT13",{"$f":"IFERROR(VLOOKUP(Table12[[#This Row],[Account]],Detail_NV__28[[#All],[Account]:[MSC PIC]],6,FALSE), \"New Hire\")","v":"DuongHT13"},{"$f":"IF(Table12[[#This Row],[MSC tháng 1]]=\"New Hire\", \"New Hire\", IF(Table12[[#This Row],[MSC tháng 1]]=Table12[[#This Row],[MSC]],\"Match\",\"New Project or New PM\"))","v":"Match"}]
[4,"HanVT2","Vũ Thị Hân","HN","NgocLTB1","Designer","UIUX03","NgocLTB1",{"$f":"IFERROR(VLOOKUP(Table12[[#This Row],[Account]],Detail_NV__28[[#All],[Account]:[MSC PIC]],6,FALSE), \"New Hire\")","v":"NgocLTB1"},{"$f":"IF(Table12[[#This Row],[MSC tháng 1]]=\"New Hire\", \"New Hire\", IF(Table12[[#This Row],[MSC tháng 1]]=Table12[[#This Row],[MSC]],\"Match\",\"New Project or New PM\"))","v":"Match"}]
[5,"HaVH12","Vũ Hải Hà","HN","HaiTV23","Developer","DEVE04","DuongHT13",{"$f":"IFERROR(VLOOKUP(Table12[[#This Row],[Account]],Detail_NV__28[[#All],[Account]:[MSC PIC]],6,FALSE), \"New Hire\")","v":"DuongHT13"},{"$f":"IF(Table12[[#This Row],[MSC tháng 1]]=\"New Hire\", \"New Hire\", IF(Table12[[#This Row],[MSC tháng 1]]=Table12[[#This Row],[MSC]],\"Match\",\"New Project or New PM\"))","v":"Match"}]
[6,"HienDT65","Đỗ Thu Hiền","HN","MaiTTQ","Executive Assistant","PSLO01","MaiTTQ",{"$f":"IFERROR(VLOOKUP(Table12[[#This Row],[Account]],Detail_NV__28[[#All],[Account]:[MSC PIC]],6,FALSE), \"New Hire\")","v":"MaiTTQ"},{"$f":"IF(Table12[[#This Row],[MSC tháng 1]]=\"New Hire\", \"New Hire\", IF(Table12[[#This Row],[MSC tháng 1]]=Table12[[#This Row],[MSC]],\"Match\",\"New Project or New PM\"))","v":"Match"}]
[7,"HieuTH7","Thân Huy Hiệu","HCM","HaiTV23","Developer","DEVE04","DuongHT13",{"$f":"IFERROR(VLOOKUP(Table12[[#This Row],[Account]],Detail_NV__28[[#All],[Account]:[MSC PIC]],6,FALSE), \"New Hire\")","v":"DuongHT13"},{"$f":"IF(Table12[[#This Row],[MSC tháng 1]]=\"New Hire\", \"New Hire\", IF(Table12[[#This Row],[MSC tháng 1]]=Table12[[#This Row],[MSC]],\"Match\",\"New Project or New PM\"))","v":"Match"}]
[8,"KhuongND6","Nguyễn Duy Khương","HCM","PhongNX1","Data Scientist","DASC05","PhongNX1",{"$f":"IFERROR(VLOOKUP(Table12[[#This Row],[Account]],Detail_NV__28[[#All],[Account]:[MSC PIC]],6,FALSE), \"New Hire\")","v":"PhongNX1"},{"$f":"IF(Table12[[#This Row],[MSC tháng 1]]=\"New Hire\", \"New Hire\", IF(Table12[[#This Row],[MSC tháng 1]]=Table12[[#This Row],[MSC]],\"Match\",\"New Project or New PM\"))","v":"Match"}]
[9,"LuongPTT","Phạm Trần Trung Lượng","HCM","HaiTV23","AI Engineer","AIEN02","DuongHT13",{"$f":"IFERROR(VLOOKUP(Table12[[#This Row],[Account]],Detail_NV__28[[#All],[Account]:[MSC PIC]],6,FALSE), \"New Hire\")","v":"DuongHT13"},{"$f":"IF(Table12[[#This Row],[MSC tháng 1]]=\"New Hire\", \"New Hire\", IF(Table12[[#This Row],[MSC tháng 1]]=Table12[[#This Row],[MSC]],\"Match\",\"New Project or New PM\"))","v":"Match"}]
{"$rows_left_out":15}
{"sheet":"RA tháng 2_AI4SE","index":8,"n_rows":29,"n_cols":12,"rows_kept":29,"cut":false,"hidden":false,"merged":[]}
["#","Account","Full Name","Special Status","Site","Head","Job title","Job Rank","Department","MSC ","MSC tháng 1","Matching Status"]
[1,"AnhPD23","Phạm Duy Anh","Active","HN","ThienN","AI Engineer","AIEN02","AI1 AI4SE","BinhPC",{"$f":"IFERROR(VLOOKUP(Table13[[#This Row],[Account]],Detail_NV__39[[Account]:[MSC PIC]],6,FALSE), \"New Hire\")","v":"ThienN"},{"$f":"IF(Table13[[#This Row],[MSC tháng 1]]=\"New Hire\", \"New Hire\", IF(Table13[[#This Row],[MSC ]]=Table13[[#This Row],[MSC tháng 1]],\"Match\",\"New Project or New PM\"))","v":"New Project or New PM"}]
[2,"CongNM8","Nguyễn Minh Công","Active","HL","NguyetNTA8","Developer","DEVE02","AI1 AI4SE",{"$f":"Table13[[#This Row],[MSC tháng 1]]","v":"NguyetNTA8"},{"$f":"IFERROR(VLOOKUP(Table13[[#This Row],[Account]],Detail_NV__39[[Account]:[MSC PIC]],6,FALSE), \"New Hire\")","v":"NguyetNTA8"},{"$f":"IF(Table13[[#This Row],[MSC tháng 1]]=\"New Hire\", \"New Hire\", IF(Table13[[#This Row],[MSC ]]=Table13[[#This Row],[MSC tháng 1]],\"Match\",\"New Project or New PM\"))","v":"Match"}]
[3,"CuongNN12","Nguyễn Như Cương","Active","HN","MinhVTN","Developer","DEVE03","AI1 AI4SE",{"$f":"Table13[[#This Row],[MSC tháng 1]]","v":"MinhVTN"},{"$f":"IFERROR(VLOOKUP(Table13[[#This Row],[Account]],Detail_NV__39[[Account]:[MSC PIC]],6,FALSE), \"New Hire\")","v":"MinhVTN"},{"$f":"IF(Table13[[#This Row],[MSC tháng 1]]=\"New Hire\", \"New Hire\", IF(Table13[[#This Row],[MSC ]]=Table13[[#This Row],[MSC tháng 1]],\"Match\",\"New Project or New PM\"))","v":"Match"}]
[4,"DucNH82","Nguyễn Huỳnh Đức","Active","HN","ViVV2","DevOps Engineer","DEVO03","AI1 AI4SE",{"$f":"Table13[[#This Row],[MSC tháng 1]]","v":"ViVV2"},{"$f":"IFERROR(VLOOKUP(Table13[[#This Row],[Account]],Detail_NV__39[[Account]:[MSC PIC]],6,FALSE), \"New Hire\")","v":"ViVV2"},{"$f":"IF(Table13[[#This Row],[MSC tháng 1]]=\"New Hire\", \"New Hire\", IF(Table13[[#This Row],[MSC ]]=Table13[[#This Row],[MSC tháng 1]],\"Match\",\"New Project or New PM\"))","v":"Match"}]
[5,"DuongLLD","Lâm Lữ Đức Dương","Active","HCM","TrinhVC3","Data Engineer","DSEN03","AI1 AI4SE","AnhNT446",{"$f":"IFERROR(VLOOKUP(Table13[[#This Row],[Account]],Detail_NV__39[[Account]:[MSC PIC]],6,FALSE), \"New Hire\")","v":"TrinhVC3"},{"$f":"IF(Table13[[#This Row],[MSC tháng 1]]=\"New Hire\", \"New Hire\", IF(Table13[[#This Row],[MSC ]]=Table13[[#This Row],[MSC tháng 1]],\"Match\",\"New Project or New PM\"))","v":"New Project or New PM"}]
[6,"DuongNH59","Nguyễn Hải Dương","Active","HN","MinhVTN","AI Engineer","AIEN03","AI1 AI4SE",{"$f":"Table13[[#This Row],[MSC tháng 1]]","v":"MinhVTN"},{"$f":"IFERROR(VLOOKUP(Table13[[#This Row],[Account]],Detail_NV__39[[Account]:[MSC PIC]],6,FALSE), \"New Hire\")","v":"MinhVTN"},{"$f":"IF(Table13[[#This Row],[MSC tháng 1]]=\"New Hire\", \"New Hire\", IF(Table13[[#This Row],[MSC ]]=Table13[[#This Row],[MSC tháng 1]],\"Match\",\"New Project or New PM\"))","v":"Match"}]
[7,"HieuPT65","Phùng Thanh Hiếu","Active","HN","MinhVTN","Developer","DEVE04","AI1 AI4SE",{"$f":"Table13[[#This Row],[MSC tháng 1]]","v":"MinhVTN"},{"$f":"IFERROR(VLOOKUP(Table13[[#This Row],[Account]],Detail_NV__39[[Account]:[MSC PIC]],6,FALSE), \"New Hire\")","v":"MinhVTN"},{"$f":"IF(Table13[[#This Row],[MSC tháng 1]]=\"New Hire\", \"New Hire\", IF(Table13[[#This Row],[MSC ]]=Table13[[#This Row],[MSC tháng 1]],\"Match\",\"New Project or New PM\"))","v":"Match"}]
[8,"HieuTT50","Trần Trung Hiếu","Active","HCM","TungNT181","Engineering Manager","CPMA05","AI1 AI4SE",{"$f":"Table13[[#This Row],[MSC tháng 1]]","v":"TungNT181"},{"$f":"IFERROR(VLOOKUP(Table13[[#This Row],[Account]],Detail_NV__39[[Account]:[MSC PIC]],6,FALSE), \"New Hire\")","v":"TungNT181"},{"$f":"IF(Table13[[#This Row],[MSC tháng 1]]=\"New Hire\", \"New Hire\", IF(Table13[[#This Row],[MSC ]]=Table13[[#This Row],[MSC tháng 1]],\"Match\",\"New Project or New PM\"))","v":"Match"}]
[9,"HungPV65","Phạm Vũ Hùng","Active","HN","TrinhVC3","AI Engineer","AIEN03","AI1 AI4SE","AnhNT446",{"$f":"IFERROR(VLOOKUP(Table13[[#This Row],[Account]],Detail_NV__39[[Account]:[MSC PIC]],6,FALSE), \"New Hire\")","v":"TrinhVC3"},{"$f":"IF(Table13[[#This Row],[MSC tháng 1]]=\"New Hire\", \"New Hire\", IF(Table13[[#This Row],[MSC ]]=Table13[[#This Row],[MSC tháng 1]],\"Match\",\"New Project or New PM\"))","v":"New Project or New PM"}]
{"$rows_left_out":20}
{"sheet":"RA tháng 1_SOL","index":9,"n_rows":136,"n_cols":10,"rows_kept":136,"cut":false,"hidden":true,"merged":[]}
["#","Account","Full Name","Special Status","Head","Department","On-going Project","On-going Project 1","PM dự án","MSC PIC"]
[1,"AnCT5","Cấn Tường An","Active","LanNTQ2","AI1 SOL TE",2,"CISD GenerativeAI","LanNTQ2","LanNTQ2"]
[{"$f":"A2+1","v":2},"AnDN2","Đinh Ngọc Ân","Active","HaiTV23","AI1 SOL TE",0,"",null,"HaiTV23"]
[{"$f":"A3+1","v":3},"AnhNT446","Nguyễn Tuấn Anh","Active","TungNT181","AI1 SOL TE",2,"AI1.SOL.DMO.xMainframe","hungnv31","trangntm13"]
[4,"AnhNV190","Nguyễn Việt Anh","Active","","AI1 SOL TE",1,"AIFarm","trungdvq","trungdvq"]
[5,"AnhPT95","Phạm Tuấn Anh","Active","KhoaNT30","AI1 SOL TE",1,"AI DRBFM","tinhnt27","trungnd25"]
[6,"AnhTQ7116","Trần Quang Anh","Active","KhuongND6","AI1 SOL TE",0,"",null,"KhuongND6"]
[7,"BaoHNQ1","Huỳnh Nhật Quốc Bảo","Active",0,"AI1 SOL TE",1,"AI1.SOL.PET_POC","trungdvq","trungdvq"]
[8,"BinhPC","Phan Công Bình","Active","TamNT17","AI1 SOL TE",1,"AI1.SOL.SB_Security","tungndt4","trungnd25"]
[9,"ChuongTN2","Trần Ngọc Chương","Active",0,"AI1 SOL TE",1,"AI1.SOL.PNP","longnt173","longnt173"]
{"$rows_left_out":127}
{"sheet":"RA tháng 1_LAB SC","index":10,"n_rows":22,"n_cols":7,"rows_kept":22,"cut":false,"hidden":true,"merged":[]}
["#","Account","Full Name","Site","Head","Job title","MSC PIC"]
[1,"AnhBT57","Bùi Tuấn Anh","HCM","HaiTV23","AI Engineer","DuongHT13"]
[{"$f":"A2+1","v":2},"C-TienNN","Nguyen Nhut Tien","USA","VanNTH19","Developer","VanNTH19"]
[{"$f":"A3+1","v":3},"DatDT67","Đỗ Thành Đạt","HN","HaiTV23","Developer","DuongHT13"]
[4,"HanVT2","Vũ Thị Hân","HN","NgocLTB1","UI/UX Designer","NgocLTB1"]
[5,"HaVH12","Vũ Hải Hà","HN","HaiTV23","Developer","DuongHT13"]
[6,"HienDT65","Đỗ Thu Hiền","HN","MaiTTQ","Executive Assistant","MaiTTQ"]
[7,"HieuTH7","Thân Huy Hiệu","HCM","HaiTV23","Developer","DuongHT13"]
[8,"KhuongND6","Nguyễn Duy Khương","HCM","PhongNX1","Data Scientist","PhongNX1"]
[9,"LuongPTT","Phạm Trần Trung Lượng","HCM","HaiTV23","AI Engineer","DuongHT13"]
{"$rows_left_out":13}
{"sheet":"RA tháng 1_AI4SE","index":11,"n_rows":32,"n_cols":7,"rows_kept":32,"cut":false,"hidden":true,"merged":[]}
["#","Account","Full Name","Site","Job title","Department","MSC PIC"]
[1,"AnhPD23","Phạm Duy Anh","HN","AI Engineer","AI1 AI4SE","ThienN"]
[{"$f":"A2+1","v":2},"CongNM8","Nguyễn Minh Công","HL","Developer","AI1 AI4SE","NguyetNTA8"]
[{"$f":"A3+1","v":3},"CuongNN12","Nguyễn Như Cương","HN","Developer","AI1 AI4SE","MinhVTN"]
[4,"DangVQM","Vũ Quốc Minh Đăng","HCM","AI Engineer","AI1 AI4SE","ThienN"]
[5,"DuongLLD","Lâm Lữ Đức Dương","HCM","Data Engineer","AI1 AI4SE","TrinhVC3"]
[6,"DuongNH59","Nguyễn Hải Dương","HN","AI Engineer","AI1 AI4SE","MinhVTN"]
[7,"HieuPT65","Phùng Thanh Hiếu","HN","Developer","AI1 AI4SE","MinhVTN"]
[8,"HieuTT50","Trần Trung Hiếu","HCM","Engineering Manager","AI1 AI4SE","TungNT181"]
[9,"HungPV65","Phạm Vũ Hùng","HN","AI Engineer","AI1 AI4SE","TrinhVC3"]
{"$rows_left_out":22}